BDBM50449861 CHEMBL3715081
SMILES CCCCOc1ccccc1C(=O)Nc1ccccc1C(=O)Nc1cccc(c1)S(=O)(=O)C(F)(F)F
InChI Key InChIKey=ZSBZZBQUCHBLKN-UHFFFAOYSA-N
Data  1 EC50
  Tab Delimited (TSV)   2D SDfile   Computed 3D by Vconf -m prep SDfile
Find this compound or compounds like it in BindingDB:
Activity Spreadsheet -- Enzyme Inhibition Constant Data from BindingDB
Found 1 hit for monomerid = 50449861
TargetRelaxin receptor 1(Homo sapiens (Human))
National Center For Advancing Translational Sciences
Curated by ChEMBL
LigandPNGBDBM50449861(CHEMBL3715081)
Affinity DataEC50:  47nM. Assay description: Agonist activity at human RXFP1 expressed in HEK293 cells assessed as increase in cAMP accumulation after 30 mins by HTRF assay
Ligand InfoPC cidPC sid
In DepthDetails ArticlePubMed