BDBM50449864 CHEMBL1491180
SMILES O=C(Nc1ccccc1C(=O)Nc1ccccc1)C1CCCCC1
InChI Key InChIKey=WWKYBCSINPENOG-UHFFFAOYSA-N
Data  1 EC50
  Tab Delimited (TSV)   2D SDfile   Computed 3D by Vconf -m prep SDfile
Find this compound or compounds like it in BindingDB:
Activity Spreadsheet -- Enzyme Inhibition Constant Data from BindingDB
Found 1 hit for monomerid = 50449864
TargetRelaxin receptor 1(Homo sapiens (Human))
National Center For Advancing Translational Sciences
Curated by ChEMBL
LigandPNGBDBM50449864(CHEMBL1491180)
Affinity DataEC50:  9.40E+4nM. Assay description: Agonist activity at human RXFP1 expressed in HEK293 cells assessed as increase in cAMP accumulation after 30 mins by HTRF assay
In DepthDetails ArticlePubMed