BDBM50449877 CHEMBL3716512
SMILES FC(F)(F)c1cccc(NC(=O)c2ccccc2NC(=O)C2CCC2)c1
InChI Key InChIKey=WKTRNQDYHNQMDX-UHFFFAOYSA-N
Data  1 EC50
  Tab Delimited (TSV)   2D SDfile   Computed 3D by Vconf -m prep SDfile
Find this compound or compounds like it in BindingDB:
Activity Spreadsheet -- Enzyme Inhibition Constant Data from BindingDB
Found 1 hit for monomerid = 50449877
TargetRelaxin receptor 1(Homo sapiens (Human))
National Center For Advancing Translational Sciences
Curated by ChEMBL
LigandPNGBDBM50449877(CHEMBL3716512)
Affinity DataEC50:  2.97E+3nM. Assay description: Agonist activity at human RXFP1 expressed in HEK293 cells assessed as increase in cAMP accumulation after 30 mins by HTRF assay
Ligand InfoPC cidPC sid
In DepthDetails ArticlePubMed