BDBM50449881 CHEMBL3716450
SMILES FC(F)(F)c1cccc(NC(=O)c2ccccc2NC(=O)c2ccccc2)c1
InChI Key InChIKey=DORHQWBAPHXLJL-UHFFFAOYSA-N
Data  1 EC50
  Tab Delimited (TSV)   2D SDfile   Computed 3D by Vconf -m prep SDfile
Find this compound or compounds like it in BindingDB:
Activity Spreadsheet -- Enzyme Inhibition Constant Data from BindingDB
Found 1 hit for monomerid = 50449881
TargetRelaxin receptor 1(Homo sapiens (Human))
National Center For Advancing Translational Sciences
Curated by ChEMBL
LigandPNGBDBM50449881(CHEMBL3716450)
Affinity DataEC50:  1.32E+3nM. Assay description: Agonist activity at human RXFP1 expressed in HEK293 cells assessed as increase in cAMP accumulation after 30 mins by HTRF assay
In DepthDetails ArticlePubMed