BDBM50450038 CHEMBL4171490
SMILES C[C@@H]1CN(CC(=O)N2CC(C)(C)c3nnc(Cc4ccc(F)cc4F)cc23)[C@@H](CN2Cc3c(cccc3F)C2=O)CN1
InChI Key InChIKey=DQKBYCWEDPITFE-XMSQKQJNSA-N
Data  2 IC50
  Tab Delimited (TSV)   2D SDfile   Computed 3D by Vconf -m prep SDfile
Find this compound or compounds like it in BindingDB:
Activity Spreadsheet -- Enzyme Inhibition Constant Data from BindingDB
Found 2 hits for monomerid = 50450038
TargetE3 ubiquitin-protein ligase XIAP(Homo sapiens (Human))
Astex Pharmaceuticals
Curated by ChEMBL
LigandPNGBDBM50450038(CHEMBL4171490)
Affinity DataIC50:  4.30nM. Assay description: Inhibition of full length FLAG-tagged XIAP (unknown origin) interaction with full length untagged caspase-9 expressed in HEK293 cells after 2 hrs by ...
Ligand InfoPC cidPC sid
In DepthDetails ArticlePubMed
TargetBaculoviral IAP repeat-containing protein 2(Homo sapiens (Human))
Astex Pharmaceuticals
Curated by ChEMBL
LigandPNGBDBM50450038(CHEMBL4171490)
Affinity DataIC50:  0.170nM. Assay description: Induction of intracellular cIAP1 degradation in human MDA-MB-231 cells after 2 hrs
Ligand InfoPC cidPC sid
In DepthDetails ArticlePubMed