BDBM50451258 CHEMBL4214276
SMILES [Cl-].COc1cc(CN2CCN(CC2)c2ccc(F)cc2)c2cc3-c4cc5OCOc5cc4CC[n+]3cc2c1O
InChI Key InChIKey=OCKFTRBUKLUOMK-UHFFFAOYSA-O
Data  1 KI
  Tab Delimited (TSV)   2D SDfile   Computed 3D by Vconf -m prep SDfile
Find this compound or compounds like it in BindingDB:
Activity Spreadsheet -- Enzyme Inhibition Constant Data from BindingDB
Found 1 hit for monomerid = 50451258
TargetNeuraminidase(Influenza A virus (A/Puerto Rico/8/34/Mount Sinai(...)
Konkuk University
Curated by ChEMBL
LigandPNGBDBM50451258(CHEMBL4214276)
Affinity DataKi:  480nM. Assay description: Inhibition of neuraminidase in influenza A virus (A/Puerto Rico/8/1934(H1N1)) pre-incubated for 30 mins before NA-Star substrate addition for 30 mins...
Ligand InfoPC cidPC sid
In DepthDetails ArticlePubMed