BDBM50452899 CHEMBL4215012
SMILES [#6]\[#6](-[#6])=[#6]\[#6]-[#6]\[#6](-[#6])=[#6]\[#6]-[#6]-[#6]-1=[#6]-[#6@@H](-[#8]-[#6]-1=O)-c1ccccc1-[#8]
InChI Key InChIKey=GQRGTIMUCZUFJO-NXZBIGBUSA-N
Data  1 IC50
  Tab Delimited (TSV)   2D SDfile   Computed 3D by Vconf -m prep SDfile
Find this compound or compounds like it in BindingDB:
Activity Spreadsheet -- Enzyme Inhibition Constant Data from BindingDB
Found 1 hit for monomerid = 50452899
Target3-hydroxy-3-methylglutaryl-coenzyme A reductase(Sus scrofa)
University Of Chinese Academy Of Sciences
Curated by ChEMBL
LigandPNGBDBM50452899(CHEMBL4215012)
Affinity DataIC50:  6.76E+3nM. Assay description: Inhibition of pig liver microsomal HMG-CoA reductase by colorimetric method
Ligand InfoPC cidPC sid
In DepthDetails ArticlePubMed