BDBM50458027 CHEMBL4213778
SMILES CCN1CCC(CN2CCc3nc(Nc4ncc(F)c(n4)-c4cc(F)c5nc(C)n(C(C)C)c5c4)ccc3C2)CC1
InChI Key InChIKey=MHLBNFOXWPVYTM-UHFFFAOYSA-N
Data  2 IC50
  Tab Delimited (TSV)   2D SDfile   Computed 3D by Vconf -m prep SDfile
Find this compound or compounds like it in BindingDB:
Activity Spreadsheet -- Enzyme Inhibition Constant Data from BindingDB
Found 2 hits for monomerid = 50458027
TargetCyclin-dependent kinase/G2/mitotic-specific cyclin- 1(Homo sapiens (Human))
Shanghai Haihe Pharmaceutical
Curated by ChEMBL
LigandPNGBDBM50458027(CHEMBL4213778)
Affinity DataIC50:  1.35E+4nM. Assay description: Inhibition of human CDK1/Cyclin-B using ULight-substrate after 1 hr by LANCE assay
Ligand InfoPC cidPC sid
In DepthDetails ArticlePubMed
TargetCyclin-dependent kinase 4/G1/S-specific cyclin-E1(Homo sapiens (Human))
Shanghai Haihe Pharmaceutical
Curated by ChEMBL
LigandPNGBDBM50458027(CHEMBL4213778)
Affinity DataIC50:  3.10nM. Assay description: Inhibition of human CDK4/cyclin D1 using ULight-substrate after 1 hr by LANCE assay
Ligand InfoPC cidPC sid
In DepthDetails ArticlePubMed