BDBM50458049 CHEMBL4214827
SMILES CC(C)n1c(C)nc2c(F)cc(cc12)-c1nc(Nc2ccc3CN(CCc3n2)C2CCN(C)CC2)ncc1F
InChI Key InChIKey=ZZJRRZQQOYYZCO-UHFFFAOYSA-N
Data  2 IC50
  Tab Delimited (TSV)   2D SDfile   Computed 3D by Vconf -m prep SDfile
Find this compound or compounds like it in BindingDB:
Activity Spreadsheet -- Enzyme Inhibition Constant Data from BindingDB
Found 2 hits for monomerid = 50458049
TargetCyclin-dependent kinase 4/G1/S-specific cyclin-E1(Homo sapiens (Human))
Shanghai Haihe Pharmaceutical
Curated by ChEMBL
LigandPNGBDBM50458049(CHEMBL4214827)
Affinity DataIC50:  1.5nM. Assay description: Inhibition of human CDK4/cyclin D1 using ULight-substrate after 1 hr by LANCE assay
Ligand InfoPC cidPC sid
In DepthDetails ArticlePubMed
TargetCyclin-dependent kinase/G2/mitotic-specific cyclin- 1(Homo sapiens (Human))
Shanghai Haihe Pharmaceutical
Curated by ChEMBL
LigandPNGBDBM50458049(CHEMBL4214827)
Affinity DataIC50:  1.00E+3nM. Assay description: Inhibition of human CDK1/Cyclin-B using ULight-substrate after 1 hr by LANCE assay
Ligand InfoPC cidPC sid
In DepthDetails ArticlePubMed