BDBM50458408 CHEMBL4216192
SMILES CC1N(C2CCCC2)c2cc(ccc2N(C)C1=O)C(=O)Nc1ccc(C)cc1C
InChI Key InChIKey=DOTVVPFDFURPQD-UHFFFAOYSA-N
Data  1 IC50
PDB links: 1 PDB ID matches this monomer.
  Tab Delimited (TSV)   2D SDfile   Computed 3D by Vconf -m prep SDfile
Find this compound or compounds like it in BindingDB:
Activity Spreadsheet -- Enzyme Inhibition Constant Data from BindingDB
Found 1 hit for monomerid = 50458408
TargetBromodomain-containing protein 4(Homo sapiens (Human))
Chinese Academy Of Sciences
Curated by ChEMBL
LigandPNGBDBM50458408(CHEMBL4216192)
Affinity DataIC50:  21nM. Assay description: Displacement of FITC-JQ1 from His6-tagged BRD4 bromodomain-1 (unknown origin) expressed in Escherichia coli BL21(DE3) after 4 hrs by fluorescence ani...
Ligand InfoPC cidPC sidPDB