BDBM50459188 CHEMBL4206878
SMILES CC(C)C[C@H](NC(=O)[C@H](Cc1ccc(O)cc1)NC(=O)[C@H](CC(C)C)NC(=O)[C@@H]1CSC[C@H](NC(=O)[C@H](Cc2ccccc2)NC(=O)[C@H](CCCNC(N)=N)NC(=O)[C@H](Cc2c[nH]c3ccccc23)NC(=O)[C@@H](N)CCC(O)=O)C(=O)NCC(=O)N2CCC[C@@H]2C(=O)N2CCC[C@H]2C(=O)N[C@@H](CCC(O)=O)C(=O)N1)C(=O)N[C@@H](C(C)C)C(=O)N[C@H](CS)C(=O)NCC(N)=O
InChI Key InChIKey=TUOJXONOSRXZRD-YFPKOZQASA-N
Data  1 IC50
  Tab Delimited (TSV)   2D SDfile   Computed 3D by Vconf -m prep SDfile
Find this compound or compounds like it in BindingDB:
Activity Spreadsheet -- Enzyme Inhibition Constant Data from BindingDB
Found 1 hit for monomerid = 50459188
TargetInsulin-degrading enzyme(Mus musculus (Mouse))
Peking University Shenzhen Graduate School
Curated by ChEMBL
LigandPNGBDBM50459188(CHEMBL4206878)
Affinity DataIC50:  60nM. Assay description: Inhibition of mouse His-tagged IDE (42 to 1019 residues) using fluorophore/quencher-tagged RPPGFSAFK(Dnp)-OH peptide as substrate preincubated for 10...
Ligand InfoPC cidPC sid
In DepthDetails ArticlePubMed