BDBM50459219 CHEMBL4207100
SMILES CN1CCN(Cc2ccc(cc2C(F)(F)F)C(=O)Nc2ccc(C)c(c2)N2Cc3cnc(Nc4ccc(C)nc4)nc3N(C)C2=O)CC1
InChI Key InChIKey=FZPWJZCQBCBZKE-UHFFFAOYSA-N
Data  2 IC50
  Tab Delimited (TSV)   2D SDfile   Computed 3D by Vconf -m prep SDfile
Find this compound or compounds like it in BindingDB:
Activity Spreadsheet -- Enzyme Inhibition Constant Data from BindingDB
Found 2 hits for monomerid = 50459219
TargetMitogen-activated protein kinase kinase kinase kinase 2(Homo sapiens (Human))
Korea University
Curated by ChEMBL
LigandPNGBDBM50459219(CHEMBL4207100)
Affinity DataIC50:  5nM. Assay description: Inhibition of GCK (unknown origin) by radiometric biochemical kinase assay
Ligand InfoPC cidPC sid
In DepthDetails ArticlePubMed
TargetActivated CDC42 kinase 1(Homo sapiens (Human))
Korea University
Curated by ChEMBL
LigandPNGBDBM50459219(CHEMBL4207100)
Affinity DataIC50:  26nM. Assay description: Inhibition of ACK1 (unknown origin) by radiometric biochemical kinase assay
Ligand InfoPC cidPC sid
In DepthDetails ArticlePubMed