BDBM50459220 CHEMBL4203337
SMILES CCN1C(=O)N(Cc2cnc(Nc3ccc(C)nc3)nc12)c1cc(NC(=O)c2ccc(C)c(c2)C(F)(F)F)ccc1C
InChI Key InChIKey=PESNFBOGJFKUMG-UHFFFAOYSA-N
Data  2 IC50
  Tab Delimited (TSV)   2D SDfile   Computed 3D by Vconf -m prep SDfile
Find this compound or compounds like it in BindingDB:
Activity Spreadsheet -- Enzyme Inhibition Constant Data from BindingDB
Found 2 hits for monomerid = 50459220
TargetMitogen-activated protein kinase kinase kinase kinase 2(Homo sapiens (Human))
Korea University
Curated by ChEMBL
LigandPNGBDBM50459220(CHEMBL4203337)
Affinity DataIC50:  34nM. Assay description: Inhibition of GCK (unknown origin) by radiometric biochemical kinase assay
Ligand InfoPC cidPC sid
In DepthDetails ArticlePubMed
TargetActivated CDC42 kinase 1(Homo sapiens (Human))
Korea University
Curated by ChEMBL
LigandPNGBDBM50459220(CHEMBL4203337)
Affinity DataIC50:  23nM. Assay description: Inhibition of ACK1 (unknown origin) by radiometric biochemical kinase assay
Ligand InfoPC cidPC sid
In DepthDetails ArticlePubMed