BDBM50459477 CHEMBL4210312
SMILES Cc1nc(N)ncc1-c1cc(Cl)cc2n(Cc3ccc(F)cc3)c(nc12)N1CC2(CNC2)C1
InChI Key InChIKey=ANXNBGIHYWKLAR-UHFFFAOYSA-N
Data  1 Kd  2 EC50
  Tab Delimited (TSV)   2D SDfile   Computed 3D by Vconf -m prep SDfile
Find this compound or compounds like it in BindingDB:
Activity Spreadsheet -- Enzyme Inhibition Constant Data from BindingDB
Found 3 hits for monomerid = 50459477
TargetSon of sevenless homolog 1(Homo sapiens (Human))
Boehringer Ingelheim Rcv
Curated by ChEMBL
LigandPNGBDBM50459477(CHEMBL4210312)
Affinity DataKd:  36nM. Assay description: Binding affinity to human recombinant N-terminal His6-tagged SOS1 (564 to 1049 residues) expressed in BL21-RIL Escherichia coli by fluorescent probe ...
Ligand InfoPC cidPC sid
In DepthDetails ArticlePubMed
TargetSon of sevenless homolog 1(Homo sapiens (Human))
Boehringer Ingelheim Rcv
Curated by ChEMBL
LigandPNGBDBM50459477(CHEMBL4210312)
Affinity DataEC50:  2.75E+4nM. Assay description: Activation of SOS1 in human NCI-H727 cells expressing KRAS G12V mutant assessed as induction of ERK1/2 T202/Y204 phosphorylation incubated for 30 min...
Ligand InfoPC cidPC sid
In DepthDetails ArticlePubMed
TargetSon of sevenless homolog 1(Homo sapiens (Human))
Boehringer Ingelheim Rcv
Curated by ChEMBL
LigandPNGBDBM50459477(CHEMBL4210312)
Affinity DataEC50:  1.40E+4nM. Assay description: Activation of SOS1 in human HeLa cells expressing wild type KRAS assessed as induction of ERK1/2 T202/Y204 phosphorylation incubated for 30 mins by I...
Ligand InfoPC cidPC sid
In DepthDetails ArticlePubMed