BDBM50460475 CHEMBL4227571
SMILES Clc1ccc(CN2CCC3(CC2)OCCc2ccsc32)cc1
InChI Key InChIKey=UOYXOHNTJGRHQG-UHFFFAOYSA-N
Data  1 IC50
  Tab Delimited (TSV)   2D SDfile   Computed 3D by Vconf -m prep SDfile
Find this compound or compounds like it in BindingDB:
Activity Spreadsheet -- Enzyme Inhibition Constant Data from BindingDB
Found 1 hit for monomerid = 50460475
TargetProbable L-lysine-epsilon aminotransferase(Mycobacterium tuberculosis (strain ATCC 25618 / H3...)
Institute Of Technology & Science-Pilani
Curated by ChEMBL
LigandPNGBDBM50460475(CHEMBL4227571)
Affinity DataIC50:  6.83E+3nM. Assay description: Inhibition of Mycobacterium tuberculosis LAT using L-lysine and alpha-ketoglutaric acid as substrate by spectrophotometric analysis
Ligand InfoPC cidPC sid
In DepthDetails ArticlePubMed