BDBM50461069 CHEMBL4228522::US10457637, Compound 66
SMILES CCc1ccc(cc1)N(CC(C)C)S(=O)(=O)c1ccc(OCC2CCOCC2)c(c1)S(N)(=O)=O
InChI Key InChIKey=HZTQGCGGNAIHBO-UHFFFAOYSA-N
Data  3 IC50
  Tab Delimited (TSV)   2D SDfile   Computed 3D by Vconf -m prep SDfile
Find this compound or compounds like it in BindingDB:
Activity Spreadsheet -- Enzyme Inhibition Constant Data from BindingDB
Found 3 hits for monomerid = 50461069
TargetNuclear receptor ROR-gamma(Homo sapiens (Human))
Nestle Skin Health
Curated by ChEMBL
LigandPNGBDBM50461069(CHEMBL4228522 | US10457637, Compound 66)
Affinity DataIC50:  89nM. Assay description: Inverse agonist activity at RORgamma (unknown origin) expressed in human HeLa-derived HG5LN cells transfected with the GAL4 DNA-binding domain fused ...
Ligand InfoPC cidPC sid
In DepthDetails ArticlePubMed
TargetInterleukin-17A(Homo sapiens (Human))
Galderma Research & Development
US Patent
LigandPNGBDBM50461069(CHEMBL4228522 | US10457637, Compound 66)
Affinity DataIC50: <100nM. Assay description: This model allows measurement of the effect of inhibitors on IL-17A secretion by CD4+ cells. The cells are frozen CD4+ cells (STEMCELL, #70026), isol...
Ligand InfoPC cidPC sid
In DepthDetails US Patent
TargetNuclear receptor ROR-gamma(Homo sapiens (Human))
Nestle Skin Health
Curated by ChEMBL
LigandPNGBDBM50461069(CHEMBL4228522 | US10457637, Compound 66)
Affinity DataIC50: <100nM. Assay description: The RORγ transactivation model was developed from the line HG5LN, which is a HeLa line that stably expresses a luciferase reporter gene controll...
Ligand InfoPC cidPC sid
In DepthDetails US Patent