BDBM50461578 CHEMBL4227819
SMILES FC(F)(F)c1cccc(c1)-c1cnn2c1[nH]nc(-c1cc[nH]n1)c2=O
InChI Key InChIKey=REUPJDSHRFDHTG-UHFFFAOYSA-N
Data  2 KI
  Tab Delimited (TSV)   2D SDfile   Computed 3D by Vconf -m prep SDfile
Find this compound or compounds like it in BindingDB:
Activity Spreadsheet -- Enzyme Inhibition Constant Data from BindingDB
Found 2 hits for monomerid = 50461578
TargetGamma-aminobutyric acid receptor subunit alpha-1/beta-2/gamma-2(Rattus norvegicus (Rat))
Universit£
Curated by ChEMBL
LigandPNGBDBM50461578(CHEMBL4227819)
Affinity DataKi:  6.5nM. Assay description: Displacement of [3H]Ro15-1788 from recombinant rat GABAAalpha1/beta2/gamma2 receptor after 90 mins by liquid scintillation counting method
Ligand InfoPC cidPC sid
In DepthDetails ArticlePubMed
TargetGamma-aminobutyric acid receptor subunit alpha-5/beta-3/gamma-2(Rattus norvegicus (Rat))
Universit£
Curated by ChEMBL
LigandPNGBDBM50461578(CHEMBL4227819)
Affinity DataKi:  144nM. Assay description: Displacement of [3H]Ro15-1788 from recombinant rat GABAAalpha5/beta3/gamma2 receptor after 90 mins by liquid scintillation counting method
Ligand InfoPC cidPC sid
In DepthDetails ArticlePubMed