BDBM50461693 CHEMBL4228096
SMILES Clc1ccc(cc1)-n1c(nc2c(ncnc12)N1CCN(CC1)c1ccccc1)-c1ccccc1Cl
InChI Key InChIKey=RBFDSCIFJHBGGS-UHFFFAOYSA-N
Data  2 KI
  Tab Delimited (TSV)   2D SDfile   Computed 3D by Vconf -m prep SDfile
Find this compound or compounds like it in BindingDB:
Activity Spreadsheet -- Enzyme Inhibition Constant Data from BindingDB
Found 2 hits for monomerid = 50461693
TargetCannabinoid receptor 1(Homo sapiens (Human))
Rti International
Curated by ChEMBL
LigandPNGBDBM50461693(CHEMBL4228096)
Affinity DataKi:  2nM. Assay description: Displacement of [3H]CP55940 from human CB1 expressed in CHOK1 cell membranes
Ligand InfoPC cidPC sid
In DepthDetails ArticlePubMed
TargetCannabinoid receptor 2(Homo sapiens (Human))
Rti International
Curated by ChEMBL
LigandPNGBDBM50461693(CHEMBL4228096)
Affinity DataKi: >1.00E+4nM. Assay description: Displacement of [3H]CP55940 from human CB2 expressed in CHOK1 cell membranes
Ligand InfoPC cidPC sid
In DepthDetails ArticlePubMed