BDBM50461698 CHEMBL4227354
SMILES CC(N1CCN(CC1)c1ncnc2n(c(nc12)-c1ccccc1Cl)-c1ccc(Cl)cc1)c1ccccc1
InChI Key InChIKey=YLGZURATVFLYJF-UHFFFAOYSA-N
Data  2 KI
  Tab Delimited (TSV)   2D SDfile   Computed 3D by Vconf -m prep SDfile
Find this compound or compounds like it in BindingDB:
Activity Spreadsheet -- Enzyme Inhibition Constant Data from BindingDB
Found 2 hits for monomerid = 50461698
TargetCannabinoid receptor 1(Homo sapiens (Human))
Rti International
Curated by ChEMBL
LigandPNGBDBM50461698(CHEMBL4227354)
Affinity DataKi:  1.10nM. Assay description: Displacement of [3H]CP55940 from human CB1 expressed in CHOK1 cell membranes
Ligand InfoPC cidPC sid
In DepthDetails ArticlePubMed
TargetCannabinoid receptor 2(Homo sapiens (Human))
Rti International
Curated by ChEMBL
LigandPNGBDBM50461698(CHEMBL4227354)
Affinity DataKi:  1.30E+3nM. Assay description: Displacement of [3H]CP55940 from human CB2 expressed in CHOK1 cell membranes
Ligand InfoPC cidPC sid
In DepthDetails ArticlePubMed