BDBM50462574 CHEMBL4241044
SMILES ONC(=O)C[C@@H](Cc1ccc2ccccc2c1)n1cc(CNC(=O)c2ccc(F)cc2)nn1
InChI Key InChIKey=RASCFMYPAZDCKQ-JOCHJYFZSA-N
Data  4 IC50
PDB links: 1 PDB ID matches this monomer.
  Tab Delimited (TSV)   2D SDfile   Computed 3D by Vconf -m prep SDfile
Find this compound or compounds like it in BindingDB:
Activity Spreadsheet -- Enzyme Inhibition Constant Data from BindingDB
Found 4 hits for monomerid = 50462574
TargetInsulin-degrading enzyme(Homo sapiens (Human))
University Of Groningen
Curated by ChEMBL
LigandPNGBDBM50462574(CHEMBL4241044)
Affinity DataIC50:  56nM. Assay description: Inhibition of human IDE using insulin as substrate preincubated for 10 mis followed by substrate addition and measured after 30 mins
Ligand InfoPC cidPC sidPDB
TargetInsulin-degrading enzyme(Homo sapiens (Human))
University Of Groningen
Curated by ChEMBL
LigandPNGBDBM50462574(CHEMBL4241044)
Affinity DataIC50:  56nM. Assay description: Inhibition of human recombinant IDE expressed in Escherichia coli BL21 (DE3) cells using insulin as substrate preincubated for 10 mins followed by su...
Ligand InfoPC cidPC sidPDB
TargetInsulin-degrading enzyme(Homo sapiens (Human))
University Of Groningen
Curated by ChEMBL
LigandPNGBDBM50462574(CHEMBL4241044)
Affinity DataIC50:  60nM. Assay description: Inhibition of wild type human IDE catalytic site using insulin as substrate preincubated for 10 mins followed by substrate addition and measured afte...
Ligand InfoPC cidPC sidPDB
TargetInsulin-degrading enzyme(Homo sapiens (Human))
University Of Groningen
Curated by ChEMBL
LigandPNGBDBM50462574(CHEMBL4241044)
Affinity DataIC50:  330nM. Assay description: Inhibition of human recombinant IDE harboring C110L/C171S/C178A/C257V/C414L/C573N/C590S/C789S/C812A/C819A/C904S/C966N/C974A mutant expressed in Esche...
Ligand InfoPC cidPC sidPDB