BDBM50463182 CHEMBL4241045
SMILES Cc1ccc2C(=O)C(Br)=C(c2c1)c1ccccc1
InChI Key InChIKey=ONHZHMLVYLDWNS-UHFFFAOYSA-N
Data  1 IC50
  Tab Delimited (TSV)   2D SDfile   Computed 3D by Vconf -m prep SDfile
Find this compound or compounds like it in BindingDB:
Activity Spreadsheet -- Enzyme Inhibition Constant Data from BindingDB
Found 1 hit for monomerid = 50463182
TargetAlpha-ketoglutarate-dependent dioxygenase alkB homolog 3(Homo sapiens (Human))
Indian Institute Of Technology Hyderabad
Curated by ChEMBL
LigandPNGBDBM50463182(CHEMBL4241045)
Affinity DataIC50: >5.00E+4nM. Assay description: Inhibition of recombinant human AlkBH3 assessed as reduction in formaldehyde release using 40-mer single N3-meC as substrate incubated for 60 mins fo...
Ligand InfoPC cidPC sid
In DepthDetails ArticlePubMed