BDBM50463419 CHEMBL4244624
SMILES Clc1ccc(cc1)-n1c(nc2c(ncnc12)N1CCN(CC1)S(=O)(=O)CC1CCCCC1)-c1ccccc1Cl
InChI Key InChIKey=WDGQYGLLMKCMFK-UHFFFAOYSA-N
Data  2 KI
  Tab Delimited (TSV)   2D SDfile   Computed 3D by Vconf -m prep SDfile
Find this compound or compounds like it in BindingDB:
Activity Spreadsheet -- Enzyme Inhibition Constant Data from BindingDB
Found 2 hits for monomerid = 50463419
TargetCannabinoid receptor 1(Homo sapiens (Human))
Rti International
Curated by ChEMBL
LigandPNGBDBM50463419(CHEMBL4244624)
Affinity DataKi:  1.70nM. Assay description: Displacement of [3H]-CP55940 from human CB1 receptor expressed in HEK293 cell membranes after 1 hr by liquid scintillation spectrometry
Ligand InfoPC cidPC sid
In DepthDetails ArticlePubMed
TargetCannabinoid receptor 2(Homo sapiens (Human))
Rti International
Curated by ChEMBL
LigandPNGBDBM50463419(CHEMBL4244624)
Affinity DataKi:  91nM. Assay description: Displacement of [3H]-CP55940 from human CB2 receptor expressed in HEK293 cell membranes after 1 hr by liquid scintillation spectrometry
Ligand InfoPC cidPC sid
In DepthDetails ArticlePubMed