BDBM50464419 CHEMBL4277185
SMILES COc1ccc2ccc3CCC(CCNC(C)=O)c3c2n1
InChI Key InChIKey=YEHQYUUTSGBBFW-UHFFFAOYSA-N
Data  3 KI
  Tab Delimited (TSV)   2D SDfile   Computed 3D by Vconf -m prep SDfile
Find this compound or compounds like it in BindingDB:
Activity Spreadsheet -- Enzyme Inhibition Constant Data from BindingDB
Found 3 hits for monomerid = 50464419
TargetMelatonin receptor type 1B(Homo sapiens (Human))
Univ. Lille
Curated by ChEMBL
LigandPNGBDBM50464419(CHEMBL4277185)
Affinity DataKi:  0.800nM. Assay description: Displacement of 2-[125I]iodomelatonin from human MT2 receptor expressed in CHO cell membranes after 120 mins by filter binding method
Ligand InfoPC cidPC sid
In DepthDetails ArticlePubMed
TargetMelatonin receptor type 1A(Homo sapiens (Human))
Univ. Lille
Curated by ChEMBL
LigandPNGBDBM50464419(CHEMBL4277185)
Affinity DataKi:  5nM. Assay description: Displacement of 2-[125I]iodomelatonin from human MT1 receptor expressed in CHO cell membranes after 120 mins by filter binding method
Ligand InfoPC cidPC sid
In DepthDetails ArticlePubMed
Target5-hydroxytryptamine receptor 2C(Homo sapiens (Human))
Univ. Lille
Curated by ChEMBL
LigandPNGBDBM50464419(CHEMBL4277185)
Affinity DataKi:  1.60E+3nM. Assay description: Displacement of [3H]-mesulergine from human 5-HT2C receptor expressed in CHO cell membranes after 60 mins by TopCount scintillation counting method
Ligand InfoPC cidPC sid
In DepthDetails ArticlePubMed