BDBM50465773 CHEMBL4277250
SMILES OC[C@H](NC(=O)[C@H]1CC(F)(F)CC[C@@H]1c1ccccc1)c1cccc(c1)C(F)(F)F
InChI Key InChIKey=RYRYLLQXWGDEKJ-QYZOEREBSA-N
Data  3 EC50
  Tab Delimited (TSV)   2D SDfile   Computed 3D by Vconf -m prep SDfile
Find this compound or compounds like it in BindingDB:
Activity Spreadsheet -- Enzyme Inhibition Constant Data from BindingDB
Found 3 hits for monomerid = 50465773
TargetPotassium voltage-gated channel subfamily KQT member 2/3(Homo sapiens (Human))
Glaxosmithkline
Curated by ChEMBL
LigandPNGBDBM50465773(CHEMBL4277250)
Affinity DataEC50:  50nM. Assay description: Activation of human Kv7.2/7.3 by patch clamp method
Ligand InfoPC cidPC sid
In DepthDetails ArticlePubMed
TargetPotassium voltage-gated channel subfamily KQT member 3/5(Homo sapiens (Human))
Glaxosmithkline
Curated by ChEMBL
LigandPNGBDBM50465773(CHEMBL4277250)
Affinity DataEC50:  250nM. Assay description: Activation of human Kv7.3/7.5 by patch clamp method
Ligand InfoPC cidPC sid
In DepthDetails ArticlePubMed
TargetPotassium voltage-gated channel subfamily KQT member 4(Homo sapiens (Human))
Glaxosmithkline
Curated by ChEMBL
LigandPNGBDBM50465773(CHEMBL4277250)
Affinity DataEC50:  20nM. Assay description: Activation of human Kv7.4 by patch clamp method
Ligand InfoPC cidPC sid
In DepthDetails ArticlePubMed