BDBM50465777 CHEMBL4288707
SMILES C[C@H](NC(=O)c1cc(F)c(F)cc1Oc1ccccc1)c1cccc(c1)S(C)(=O)=O
InChI Key InChIKey=LZLSVJXKYDXMGI-AWEZNQCLSA-N
Data  3 EC50
  Tab Delimited (TSV)   2D SDfile   Computed 3D by Vconf -m prep SDfile
Find this compound or compounds like it in BindingDB:
Activity Spreadsheet -- Enzyme Inhibition Constant Data from BindingDB
Found 3 hits for monomerid = 50465777
TargetPotassium voltage-gated channel subfamily KQT member 2/3(Homo sapiens (Human))
Glaxosmithkline
Curated by ChEMBL
LigandPNGBDBM50465777(CHEMBL4288707)
Affinity DataEC50:  130nM. Assay description: Activation of human Kv7.2/7.3 by patch clamp method
Ligand InfoPC cidPC sid
In DepthDetails ArticlePubMed
TargetPotassium voltage-gated channel subfamily KQT member 4(Homo sapiens (Human))
Glaxosmithkline
Curated by ChEMBL
LigandPNGBDBM50465777(CHEMBL4288707)
Affinity DataEC50:  160nM. Assay description: Activation of human Kv7.4 by patch clamp method
Ligand InfoPC cidPC sid
In DepthDetails ArticlePubMed
TargetPotassium voltage-gated channel subfamily KQT member 3/5(Homo sapiens (Human))
Glaxosmithkline
Curated by ChEMBL
LigandPNGBDBM50465777(CHEMBL4288707)
Affinity DataEC50:  200nM. Assay description: Activation of human Kv7.3/7.5 by patch clamp method
Ligand InfoPC cidPC sid
In DepthDetails ArticlePubMed