BDBM50465778 CHEMBL4287478
SMILES C[C@H](NC(=O)[C@H]1CC(F)(F)CC[C@@H]1c1ccccc1)c1ccccc1
InChI Key InChIKey=CZZMLALOKXNFIA-IPELMVKDSA-N
Data  3 EC50
  Tab Delimited (TSV)   2D SDfile   Computed 3D by Vconf -m prep SDfile
Find this compound or compounds like it in BindingDB:
Activity Spreadsheet -- Enzyme Inhibition Constant Data from BindingDB
Found 3 hits for monomerid = 50465778
TargetPotassium voltage-gated channel subfamily KQT member 2/3(Homo sapiens (Human))
Glaxosmithkline
Curated by ChEMBL
LigandPNGBDBM50465778(CHEMBL4287478)
Affinity DataEC50:  200nM. Assay description: Activation of human Kv7.2/7.3 by patch clamp method
Ligand InfoPC cidPC sid
In DepthDetails ArticlePubMed
TargetPotassium voltage-gated channel subfamily KQT member 3/5(Homo sapiens (Human))
Glaxosmithkline
Curated by ChEMBL
LigandPNGBDBM50465778(CHEMBL4287478)
Affinity DataEC50:  400nM. Assay description: Activation of human Kv7.3/7.5 by patch clamp method
Ligand InfoPC cidPC sid
In DepthDetails ArticlePubMed
TargetPotassium voltage-gated channel subfamily KQT member 4(Homo sapiens (Human))
Glaxosmithkline
Curated by ChEMBL
LigandPNGBDBM50465778(CHEMBL4287478)
Affinity DataEC50:  4.00E+3nM. Assay description: Activation of human Kv7.4 by patch clamp method
Ligand InfoPC cidPC sid
In DepthDetails ArticlePubMed