BDBM50466101 CHEMBL4279879
SMILES [H][C@]12OC(=O)C(=C)[C@]1([H])[C@@H](CC(C)=C1C(=O)C=C(C)[C@]21[H])OC(=O)C(\C)=C\C
InChI Key InChIKey=SOUHOZAOAMAEFT-YZDREFLHSA-N
Data  2 IC50
  Tab Delimited (TSV)   2D SDfile   Computed 3D by Vconf -m prep SDfile
Find this compound or compounds like it in BindingDB:
Activity Spreadsheet -- Enzyme Inhibition Constant Data from BindingDB
Found 2 hits for monomerid = 50466101
TargetDihydroorotate dehydrogenase (fumarate)(Leishmania major)
University Of S£O Paulo
Curated by ChEMBL
LigandPNGBDBM50466101(CHEMBL4279879)
Affinity DataIC50:  2.68E+4nM. Assay description: Inhibition of recombinant oligo-histidine-tagged Leishmania major DHODH expressed in Escherichia coli BL21(DE3) cells using DHO as substrate measured...
Ligand InfoPC cidPC sid
In DepthDetails ArticlePubMed
TargetDihydroorotate dehydrogenase (fumarate)(Leishmania major)
University Of S£O Paulo
Curated by ChEMBL
LigandPNGBDBM50466101(CHEMBL4279879)
Affinity DataIC50:  2.51E+4nM. Assay description: Inhibition of recombinant oligo-histidine-tagged Leishmania major DHODH expressed in Escherichia coli BL21(DE3) cells using DHO as substrate measured...
Ligand InfoPC cidPC sid
In DepthDetails ArticlePubMed