BDBM50466111 CHEBI:3768::CHEMBL462825
SMILES [H][C@]12OC(=O)C(=C)[C@]1([H])[C@H](CC(C)=CCC\C(CO)=C\2)OC(=O)C(=C)[C@@H](O)CO
InChI Key InChIKey=ZTDFZLVUIVPZDU-QGNHJMHWSA-N
Data  2 IC50
  Tab Delimited (TSV)   2D SDfile   Computed 3D by Vconf -m prep SDfile
Find this compound or compounds like it in BindingDB:
Activity Spreadsheet -- Enzyme Inhibition Constant Data from BindingDB
Found 2 hits for monomerid = 50466111
TargetDihydroorotate dehydrogenase (fumarate)(Leishmania major)
University Of S£O Paulo
Curated by ChEMBL
LigandPNGBDBM50466111(CHEBI:3768 | CHEMBL462825)
Affinity DataIC50:  3.61E+5nM. Assay description: Inhibition of recombinant oligo-histidine-tagged Leishmania major DHODH expressed in Escherichia coli BL21(DE3) cells using DHO as substrate measured...
In DepthDetails ArticlePubMed
TargetDihydroorotate dehydrogenase (fumarate)(Leishmania major)
University Of S£O Paulo
Curated by ChEMBL
LigandPNGBDBM50466111(CHEBI:3768 | CHEMBL462825)
Affinity DataIC50:  3.98E+5nM. Assay description: Inhibition of recombinant oligo-histidine-tagged Leishmania major DHODH expressed in Escherichia coli BL21(DE3) cells using DHO as substrate measured...
In DepthDetails ArticlePubMed