BDBM50467991 CHEMBL4293288
SMILES NS(=O)(=O)c1ccc(cc1)\N=c1/scc(-c2ccccc2)n1-c1ccccc1
InChI Key InChIKey=FXDROENCOYNWHS-LNVKXUELSA-N
Data  4 KI
  Tab Delimited (TSV)   2D SDfile   Computed 3D by Vconf -m prep SDfile
Find this compound or compounds like it in BindingDB:
Activity Spreadsheet -- Enzyme Inhibition Constant Data from BindingDB
Found 4 hits for monomerid = 50467991
TargetCarbonic anhydrase 12(Homo sapiens (Human))
University Of Cagliari
Curated by ChEMBL
LigandPNGBDBM50467991(CHEMBL4293288)
Affinity DataKi:  300nM. Assay description: Inhibition of human CA12 by Lineweaver-Burk plot analysis
Ligand InfoPC cidPC sid
In DepthDetails ArticlePubMed
TargetCarbonic anhydrase 2(Homo sapiens (Human))
University Of Cagliari
Curated by ChEMBL
LigandPNGBDBM50467991(CHEMBL4293288)
Affinity DataKi:  3.10E+3nM. Assay description: Inhibition of human CA2 by Lineweaver-Burk plot analysis
Ligand InfoPC cidPC sid
In DepthDetails ArticlePubMed
TargetCarbonic anhydrase 9(Homo sapiens (Human))
University Of Cagliari
Curated by ChEMBL
LigandPNGBDBM50467991(CHEMBL4293288)
Affinity DataKi:  3.54E+3nM. Assay description: Inhibition of human CA9 by Lineweaver-Burk plot analysis
Ligand InfoPC cidPC sid
In DepthDetails ArticlePubMed
TargetCarbonic anhydrase 1(Homo sapiens (Human))
University Of Cagliari
Curated by ChEMBL
LigandPNGBDBM50467991(CHEMBL4293288)
Affinity DataKi:  8.02E+3nM. Assay description: Inhibition of human CA1 by Lineweaver-Burk plot analysis
Ligand InfoPC cidPC sid
In DepthDetails ArticlePubMed