BDBM50468052 CHEMBL4283844
SMILES OC(=O)CCNc1cc(nc(n1)-c1ccccn1)N1CCCN(CC1)C(=O)C=C
InChI Key InChIKey=GQZPLTPYSQYTFB-UHFFFAOYSA-N
Data  3 IC50  1 Kd
PDB links: 1 PDB ID matches this monomer.
  Tab Delimited (TSV)   2D SDfile   Computed 3D by Vconf -m prep SDfile
Find this compound or compounds like it in BindingDB:
Activity Spreadsheet -- Enzyme Inhibition Constant Data from BindingDB
Found 4 hits for monomerid = 50468052
TargetLysine-specific demethylase 6A(Homo sapiens (Human))
The University Of Texas M.D. Anderson Cancer Center
Curated by ChEMBL
LigandPNGBDBM50468052(CHEMBL4283844)
Affinity DataIC50:  3.90E+4nM. Assay description: Inhibition of KDM6A (880 to 1401 residues) (unknown origin) using H3 ( 21 to 44 residues) K27me3 as substrate preincubated for 15 min followed by sub...
Ligand InfoPC cidPC sidPDB
In DepthDetails ArticlePubMed
TargetLysine-specific demethylase 4A(Homo sapiens (Human))
The University Of Texas M.D. Anderson Cancer Center
Curated by ChEMBL
LigandPNGBDBM50468052(CHEMBL4283844)
Affinity DataIC50:  2.30E+5nM. Assay description: Inhibition of KDM4A (1 to 350 residues) (unknown origin) using H3 ( 1 to 15 residues) K9me3 as substrate preincubated for 15 min followed by substrat...
Ligand InfoPC cidPC sidPDB
In DepthDetails ArticlePubMed
TargetLysine-specific demethylase 5A(Homo sapiens (Human))
The University Of Texas M.D. Anderson Cancer Center
Curated by ChEMBL
LigandPNGBDBM50468052(CHEMBL4283844)
Affinity DataIC50:  7.10E+4nM. Assay description: Inhibition of KDM5A ARID/PhD1 domain deletion mutant (1 to 739 residues) (unknown origin) using H3 ( 1 to 24 residues) K4me3 as substrate preincubate...
Ligand InfoPC cidPC sidPDB
TargetLysine-specific demethylase 5A(Homo sapiens (Human))
The University Of Texas M.D. Anderson Cancer Center
Curated by ChEMBL
LigandPNGBDBM50468052(CHEMBL4283844)
Affinity DataKd:  6.00E+3nM. Assay description: Binding affinity to KDM5A ARID/PhD1 domain deletion mutant (1 to 588 residues) (unknown origin) by ITC assay
Ligand InfoPC cidPC sidPDB