BDBM50469091 CHEMBL4283261
SMILES OC(=O)c1csc(n1)-c1ccccc1Cl
InChI Key InChIKey=BWZOFJBZSUCPSM-UHFFFAOYSA-N
Data  2 KI
  Tab Delimited (TSV)   2D SDfile   Computed 3D by Vconf -m prep SDfile
Find this compound or compounds like it in BindingDB:
Activity Spreadsheet -- Enzyme Inhibition Constant Data from BindingDB
Found 2 hits for monomerid = 50469091
TargetTartrate-resistant acid phosphatase type 5(Sus scrofa)
The University Of Queensland
Curated by ChEMBL
LigandPNGBDBM50469091(CHEMBL4283261)
Affinity DataKi:  6.30E+5nM. Assay description: Competitive inhibition of pig purple acid phosphatase Fe(3)Fe(2) state assessed as enzyme-inhibitor complex using pNPP as substrate by UV/Vis spectro...
In DepthDetails ArticlePubMed
TargetPurple acid phosphatase(Phaseolus vulgaris)
The University Of Queensland
Curated by ChEMBL
LigandPNGBDBM50469091(CHEMBL4283261)
Affinity DataKi:  9.20E+5nM. Assay description: Competitive inhibition of red kidney bean purple acid phosphatase Fe(3)Fe(2) state assessed as enzyme-inhibitor complex using pNPP as substrate by UV...
In DepthDetails ArticlePubMed