BDBM50469333 CHEMBL4290175
SMILES FC(F)(F)c1cc(NC(=O)Nc2ccnc(Cl)c2)ccn1
InChI Key InChIKey=HQYQXQQPQJWOAU-UHFFFAOYSA-N
Data  2 IC50
  Tab Delimited (TSV)   2D SDfile   Computed 3D by Vconf -m prep SDfile
Find this compound or compounds like it in BindingDB:
Activity Spreadsheet -- Enzyme Inhibition Constant Data from BindingDB
Found 2 hits for monomerid = 50469333
TargetTranscription activator BRG1(Homo sapiens (Human))
Novartis Institutes For Biomedical Research
Curated by ChEMBL
LigandPNGBDBM50469333(CHEMBL4290175)
Affinity DataIC50:  30nM. Assay description: Inhibition of recombinant His6-tagged BRG1 ATPase-SnAC (658 to 1361 residues) (unknown origin) expressed in insect sf9 cells preincubated for 5 mins ...
Ligand InfoPC cidPC sid
In DepthDetails ArticlePubMed
TargetProbable global transcription activator SNF2L2(Homo sapiens (Human))
Novartis Institutes For Biomedical Research
Curated by ChEMBL
LigandPNGBDBM50469333(CHEMBL4290175)
Affinity DataIC50:  60nM. Assay description: Inhibition of recombinant His10-tagged ZZ-HCV3C-BRM ATPase-SnAC (636 to 1331 residues) (unknown origin) expressed in insect sf9 cells preincubated fo...
Ligand InfoPC cidPC sid
In DepthDetails ArticlePubMed