BDBM50469651 CHEMBL26996
SMILES ON1Cn2c3ccccc3c3c4C(=O)NC(=O)c4c4c5ccccc5n(C1)c4c23
InChI Key InChIKey=ZZTLPYGPLWSXOM-UHFFFAOYSA-N
Data  1 IC50
  Tab Delimited (TSV)   2D SDfile   Computed 3D by Vconf -m prep SDfile
Find this compound or compounds like it in BindingDB:
Activity Spreadsheet -- Enzyme Inhibition Constant Data from BindingDB
Found 1 hit for monomerid = 50469651
TargetProtein kinase C zeta type(Rattus norvegicus)TBA
LigandPNGBDBM50469651(CHEMBL26996)
Affinity DataIC50:  90nM. Assay description: In vitro inhibition of protein kinase C from rat brain.
Ligand InfoPC cidPC sid
In DepthDetails Article