BDBM50469654 CHEMBL28202
SMILES CN1Cn2c3ccccc3c3c4C(=O)NC(=O)c4c4c5ccccc5n(C1)c4c23
InChI Key InChIKey=LUPDLTJTGCJZDV-UHFFFAOYSA-N
Data  1 IC50
  Tab Delimited (TSV)   2D SDfile   Computed 3D by Vconf -m prep SDfile
Find this compound or compounds like it in BindingDB:
Activity Spreadsheet -- Enzyme Inhibition Constant Data from BindingDB
Found 1 hit for monomerid = 50469654
TargetProtein kinase C zeta type(Rattus norvegicus)TBA
LigandPNGBDBM50469654(CHEMBL28202)
Affinity DataIC50:  86nM. Assay description: In vitro inhibition of protein kinase C from rat brain.
Ligand InfoPC cidPC sid
In DepthDetails Article