BDBM50470539 CHEMBL4293877
SMILES [H][C@]1([C@@H](C)CC)[C@@H](OC1=O)C(=O)N[C@@H](C(C)C)C(=O)N[C@@H](C(C)C)C(=O)OCc1ccccc1
InChI Key InChIKey=YREKTTIVMIRGOJ-RKFFNLMFSA-N
Data  5 IC50
  Tab Delimited (TSV)   2D SDfile   Computed 3D by Vconf -m prep SDfile
Find this compound or compounds like it in BindingDB:
Activity Spreadsheet -- Enzyme Inhibition Constant Data from BindingDB
Found 5 hits for monomerid = 50470539
TargetProteasome subunit beta type-2(Homo sapiens (Human))
New Mexico Institute Of Mining And Technology
Curated by ChEMBL
LigandPNGBDBM50470539(CHEMBL4293877)
Affinity DataIC50:  1.43E+3nM. Assay description: Inhibition of 20S proteasome beta2 subunit in human Jurkat cell lysate using Suc-RLR-AMC as substrate pretreated for 30 mins followed by substrate ad...
Ligand InfoPC cidPC sid
In DepthDetails ArticlePubMed
TargetProteasome subunit beta type-5(Homo sapiens (Human))
New Mexico Institute Of Mining And Technology
Curated by ChEMBL
LigandPNGBDBM50470539(CHEMBL4293877)
Affinity DataIC50:  7nM. Assay description: Inhibition of 20S proteasome beta5 subunit in human Jurkat cell lysate using Suc-LLVY-AMC as substrate pretreated for 30 mins followed by substrate a...
Ligand InfoPC cidPC sid
In DepthDetails ArticlePubMed
TargetProteasome subunit beta type-8(Homo sapiens (Human))
New Mexico Institute Of Mining And Technology
Curated by ChEMBL
LigandPNGBDBM50470539(CHEMBL4293877)
Affinity DataIC50:  19nM. Assay description: Inhibition of human immunoproteasome beta5 subunit using Suc-RLR-AMC as substrate pretreated for 30 mins followed by substrate addition and measured ...
Ligand InfoPC cidPC sid
In DepthDetails ArticlePubMed
TargetmRNA cap guanine-N7 methyltransferase(Homo sapiens)
New Mexico Institute Of Mining And Technology
Curated by ChEMBL
LigandPNGBDBM50470539(CHEMBL4293877)
Affinity DataIC50:  2.48E+3nM. Assay description: Inhibition of yeast 20S proteasome beta1 subunit using fluorescent substrate pretreated for 30 mins followed by substrate addition and measured after...
Ligand InfoPC cidPC sid
In DepthDetails ArticlePubMed
TargetmRNA cap guanine-N7 methyltransferase(Homo sapiens)
New Mexico Institute Of Mining And Technology
Curated by ChEMBL
LigandPNGBDBM50470539(CHEMBL4293877)
Affinity DataIC50:  2.61E+4nM. Assay description: Inhibition of yeast 20S proteasome beta2 subunit using SUC-RLR-AMC as substrate pretreated for 30 mins followed by substrate addition and measured af...
Ligand InfoPC cidPC sid
In DepthDetails ArticlePubMed