BDBM50473136 CHEMBL13343
SMILES C1CN=C(N1)c1ccc2[nH]ccc2c1
InChI Key InChIKey=RGYRBHYUJLLHBZ-UHFFFAOYSA-N
Data  1 KI
  Tab Delimited (TSV)   2D SDfile   Computed 3D by Vconf -m prep SDfile
Find this compound or compounds like it in BindingDB:
Activity Spreadsheet -- Enzyme Inhibition Constant Data from BindingDB
Found 1 hit for monomerid = 50473136
TargetNischarin(Homo sapiens (Human))
Universit£
Curated by ChEMBL
LigandPNGBDBM50473136(CHEMBL13343)
Affinity DataKi:  2.5nM. Assay description: Binding affinity for imidazoline receptor I-2 in rabbit kidney homogenate (relative to [3H]-Idazoxan radioligand)
Ligand InfoPC cidPC sid
In DepthDetails ArticlePubMed