BDBM50473196 CHEMBL276276
SMILES CSc1ccc(cc1)C1=NCCN1
InChI Key InChIKey=DFPWUZZLUNYLRX-UHFFFAOYSA-N
Data  1 KI
  Tab Delimited (TSV)   2D SDfile   Computed 3D by Vconf -m prep SDfile
Find this compound or compounds like it in BindingDB:
Activity Spreadsheet -- Enzyme Inhibition Constant Data from BindingDB
Found 1 hit for monomerid = 50473196
TargetNischarin(Homo sapiens (Human))
Universit£
Curated by ChEMBL
LigandPNGBDBM50473196(CHEMBL276276)
Affinity DataKi:  4nM. Assay description: Binding affinity for imidazoline receptor I-2 in rabbit kidney homogenate (relative to [3H]-Idazoxan radioligand)
Ligand InfoPC cidPC sid
In DepthDetails ArticlePubMed