BDBM50474254 CHEMBL320130
SMILES CCNc1cc(ccn1)-c1c(nc(SC)n1C1CC(C)(C)NC(C)(C)C1)-c1ccc(F)cc1
InChI Key InChIKey=XVVXOPCGELRSQC-UHFFFAOYSA-N
Data  5 IC50
  Tab Delimited (TSV)   2D SDfile   Computed 3D by Vconf -m prep SDfile
Find this compound or compounds like it in BindingDB:
Activity Spreadsheet -- Enzyme Inhibition Constant Data from BindingDB
Found 5 hits for monomerid = 50474254
TargetMitogen-activated protein kinase 11/12/13/14(Homo sapiens (Human))
Eberhard-Karls-University T£Bingen
Curated by ChEMBL
LigandPNGBDBM50474254(CHEMBL320130)
Affinity DataIC50:  620nM. Assay description: Inhibitory activity against induction of IL-1-beta release in PBMCs
Ligand InfoPC cidPC sid
In DepthDetails ArticlePubMed
TargetMitogen-activated protein kinase 11/12/13/14(Homo sapiens (Human))
Eberhard-Karls-University T£Bingen
Curated by ChEMBL
LigandPNGBDBM50474254(CHEMBL320130)
Affinity DataIC50:  220nM. Assay description: Inhibitory activity against mitogen-activated protein kinase p38 at 10 e-4 to 10 e-8 M concentration
Ligand InfoPC cidPC sid
In DepthDetails ArticlePubMed
TargetMitogen-activated protein kinase 11/12/13/14(Homo sapiens (Human))
Eberhard-Karls-University T£Bingen
Curated by ChEMBL
LigandPNGBDBM50474254(CHEMBL320130)
Affinity DataIC50:  2.90E+3nM. Assay description: Inhibitory activity against TNF-alpha release in PBM cells
Ligand InfoPC cidPC sid
In DepthDetails ArticlePubMed
TargetMitogen-activated protein kinase 11/12/13/14(Homo sapiens (Human))
Eberhard-Karls-University T£Bingen
Curated by ChEMBL
LigandPNGBDBM50474254(CHEMBL320130)
Affinity DataIC50:  2.70E+3nM. Assay description: Inhibition of p38-related IL1-beta release by whole blood cells at 10 e-4 to 10 e-8 M
Ligand InfoPC cidPC sid
In DepthDetails ArticlePubMed
TargetMitogen-activated protein kinase 11/12/13/14(Homo sapiens (Human))
Eberhard-Karls-University T£Bingen
Curated by ChEMBL
LigandPNGBDBM50474254(CHEMBL320130)
Affinity DataIC50:  1.10E+4nM. Assay description: Inhibition of p38-related TNF-alpha release by whole blood cells at 10 e-4 to 10 e-8 M
Ligand InfoPC cidPC sid
In DepthDetails ArticlePubMed