BDBM50474256 CHEMBL110947
SMILES CSc1nc(c([nH]1)-c1ccnc(NCc2ccc(Cl)c(Cl)c2)c1)-c1ccc(F)cc1
InChI Key InChIKey=OKGRQZVTGRLIKW-UHFFFAOYSA-N
Data  3 IC50
  Tab Delimited (TSV)   2D SDfile   Computed 3D by Vconf -m prep SDfile
Find this compound or compounds like it in BindingDB:
Activity Spreadsheet -- Enzyme Inhibition Constant Data from BindingDB
Found 3 hits for monomerid = 50474256
TargetMitogen-activated protein kinase 11/12/13/14(Homo sapiens (Human))
Eberhard-Karls-University T£Bingen
Curated by ChEMBL
LigandPNGBDBM50474256(CHEMBL110947)
Affinity DataIC50:  700nM. Assay description: Inhibitory activity against mitogen-activated protein kinase p38 at 10 e-4 to 10 e-8 M concentration
Ligand InfoPC cidPC sid
In DepthDetails ArticlePubMed
TargetMitogen-activated protein kinase 11/12/13/14(Homo sapiens (Human))
Eberhard-Karls-University T£Bingen
Curated by ChEMBL
LigandPNGBDBM50474256(CHEMBL110947)
Affinity DataIC50:  720nM. Assay description: Inhibitory activity against TNF-alpha release in PBM cells
Ligand InfoPC cidPC sid
In DepthDetails ArticlePubMed
TargetMitogen-activated protein kinase 11/12/13/14(Homo sapiens (Human))
Eberhard-Karls-University T£Bingen
Curated by ChEMBL
LigandPNGBDBM50474256(CHEMBL110947)
Affinity DataIC50:  230nM. Assay description: Inhibitory activity against induction of IL-1-beta release in PBMCs
Ligand InfoPC cidPC sid
In DepthDetails ArticlePubMed