BDBM50474265 CHEMBL110263
SMILES CSc1nc(c([nH]1)-c1ccnc(NCc2ccc(C)cc2)c1)-c1ccc(F)cc1
InChI Key InChIKey=GVGLHMXYNVASQP-UHFFFAOYSA-N
Data  3 IC50
  Tab Delimited (TSV)   2D SDfile   Computed 3D by Vconf -m prep SDfile
Find this compound or compounds like it in BindingDB:
Activity Spreadsheet -- Enzyme Inhibition Constant Data from BindingDB
Found 3 hits for monomerid = 50474265
TargetMitogen-activated protein kinase 11/12/13/14(Homo sapiens (Human))
Eberhard-Karls-University T£Bingen
Curated by ChEMBL
LigandPNGBDBM50474265(CHEMBL110263)
Affinity DataIC50:  670nM. Assay description: Inhibitory activity against TNF-alpha release in PBM cells
Ligand InfoPC cidPC sid
In DepthDetails ArticlePubMed
TargetMitogen-activated protein kinase 11/12/13/14(Homo sapiens (Human))
Eberhard-Karls-University T£Bingen
Curated by ChEMBL
LigandPNGBDBM50474265(CHEMBL110263)
Affinity DataIC50:  85nM. Assay description: Inhibitory activity against induction of IL-1-beta release in PBMCs
Ligand InfoPC cidPC sid
In DepthDetails ArticlePubMed
TargetMitogen-activated protein kinase 11/12/13/14(Homo sapiens (Human))
Eberhard-Karls-University T£Bingen
Curated by ChEMBL
LigandPNGBDBM50474265(CHEMBL110263)
Affinity DataIC50:  830nM. Assay description: Inhibitory activity against mitogen-activated protein kinase p38 at 10 e-4 to 10 e-8 M concentration
Ligand InfoPC cidPC sid
In DepthDetails ArticlePubMed