BDBM50475464 CHEMBL197574
SMILES O=S(=O)(c1coc2c(cccc12)N1CCNCC1)c1ccccc1
InChI Key InChIKey=HEUUCWHNGSXCEA-UHFFFAOYSA-N
Data  1 KI
  Tab Delimited (TSV)   2D SDfile   Computed 3D by Vconf -m prep SDfile
Find this compound or compounds like it in BindingDB:
Activity Spreadsheet -- Enzyme Inhibition Constant Data from BindingDB
Found 1 hit for monomerid = 50475464
Target5-hydroxytryptamine receptor 6(Homo sapiens (Human))
Glaxosmithkline
Curated by ChEMBL
LigandPNGBDBM50475464(CHEMBL197574)
Affinity DataKi:  1.30nM. Assay description: Displacement of [3H]LSD from human 5-hydroxytryptamine 6 receptor expressed in HeLa cells
Ligand InfoPC cidPC sid
In DepthDetails ArticlePubMed