BDBM50478845 CHEMBL495662
SMILES [#6]-[#6]-[#6]-[#6@@H](-[#8]-[#6](-[#6])=O)-[#6]-1=[#6](Br)\[#6](-[#8]-[#6]-1=O)=[#6](\Br)Br
InChI Key InChIKey=GKLOGZLMFMQARH-ZCFIWIBFSA-N
Data  1 IC50
  Tab Delimited (TSV)   2D SDfile   Computed 3D by Vconf -m prep SDfile
Find this compound or compounds like it in BindingDB:
Activity Spreadsheet -- Enzyme Inhibition Constant Data from BindingDB
Found 1 hit for monomerid = 50478845
TargetReverse transcriptase(Human immunodeficiency virus 1)
Australian Institute Of Marine Science
Curated by ChEMBL
LigandPNGBDBM50478845(CHEMBL495662)
Affinity DataIC50:  7.00E+5nM. Assay description: Inhibition of HIV1 RT at 200 uM
Ligand InfoPC cidPC sid
In DepthDetails ArticlePubMed