BDBM50478847 CHEMBL505711
SMILES CCC[C@@H](O)C1=C(Br)\C(OC1=O)=C\I
InChI Key InChIKey=KCFLZMAPXDKUEQ-WEWOIACBSA-N
Data  1 IC50
  Tab Delimited (TSV)   2D SDfile   Computed 3D by Vconf -m prep SDfile
Find this compound or compounds like it in BindingDB:
Activity Spreadsheet -- Enzyme Inhibition Constant Data from BindingDB
Found 1 hit for monomerid = 50478847
TargetReverse transcriptase(Human immunodeficiency virus 1)
Australian Institute Of Marine Science
Curated by ChEMBL
LigandPNGBDBM50478847(CHEMBL505711)
Affinity DataIC50:  7.00E+5nM. Assay description: Inhibition of HIV1 RT at 200 uM
Ligand InfoPC cidPC sid
In DepthDetails ArticlePubMed