BDBM50479766 CHEMBL453962
SMILES CSCC[C@H](NC(=O)CNC(=O)[C@@H](NC(=O)CNC(=O)[C@@H](NC(=O)CNC(=O)[C@@H](NC(=O)[C@H](CCCNC(N)=N)NC(=O)[C@H](Cc1ccccc1)NC(=O)[C@@H](N)CO)[C@@H](C)O)C(C)C)[C@@H](C)O)C(=O)N[C@@H](CCCCN)C(=O)N[C@@H](CCCCN)C(=O)N[C@@H]([C@@H](C)O)C(=O)N[C@@H](CO)C(=O)N[C@@H](Cc1ccccc1)C(=O)N[C@@H](CCC(N)=O)C(=O)N[C@@H](CCCNC(N)=N)C(=O)N[C@@H](C)C(=O)N[C@@H](CCCCN)C(=O)N[C@@H](CO)C(O)=O
InChI Key InChIKey=LHYTYPWJWYNCJE-PMQYQNHMSA-N
Data  1 EC50
  Tab Delimited (TSV)   2D SDfile   Computed 3D by Vconf -m prep SDfile
Find this compound or compounds like it in BindingDB:
Activity Spreadsheet -- Enzyme Inhibition Constant Data from BindingDB
Found 1 hit for monomerid = 50479766
TargetNeuropeptide S receptor(Mus musculus)
University Of Ferrara
Curated by ChEMBL
LigandPNGBDBM50479766(CHEMBL453962)
Affinity DataEC50:  102nM. Assay description: Agonist activity at mouse NPSR expressed in HEK293 cells assessed as increase in intracellular calcium mobilization by FLIPR
Ligand InfoPC cidPC sid
In DepthDetails ArticlePubMed