BDBM50481208 CHEMBL594330
SMILES CC(C)C[C@H](NC(=O)[C@H](Cc1cnc[nH]1)NC(=O)[C@H](CS)NC(=O)[C@@H](NC(=O)[C@@H]1CCCN1C(=O)[C@H](CC(N)=O)NC(=O)[C@H](CO)NC(=O)[C@H](CS)NC(=O)[C@H](CS)NC(=O)CN)C(C)C)C(=O)N[C@@H](C)C(=O)N[C@@H](Cc1cnc[nH]1)C(=O)N[C@@H](CO)C(=O)N[C@@H](CC(N)=O)C(=O)N[C@@H](CC(C)C)C(=O)N[C@@H](CS)C(O)=O
InChI Key InChIKey=FLAHTCIVXKKZAR-LWMCYQQMSA-N
Data  2 IC50
  Tab Delimited (TSV)   2D SDfile   Computed 3D by Vconf -m prep SDfile
Find this compound or compounds like it in BindingDB:
Activity Spreadsheet -- Enzyme Inhibition Constant Data from BindingDB
Found 2 hits for monomerid = 50481208
TargetNeuronal acetylcholine receptor subunit alpha-3/beta-2(Homo sapiens (Human))
Boise State University
Curated by ChEMBL
LigandPNGBDBM50481208(CHEMBL594330)
Affinity DataIC50:  8.70nM. Assay description: Inhibition of alpha3beta2 nAChR
Ligand InfoKEGGPC cidPC sid
In DepthDetails ArticlePubMed
TargetNeuronal acetylcholine receptor subunit alpha-6/beta-2(Homo sapiens (Human))
Boise State University
Curated by ChEMBL
LigandPNGBDBM50481208(CHEMBL594330)
Affinity DataIC50:  0.160nM. Assay description: Inhibition of alpha6beta2 nAChR
Ligand InfoKEGGPC cidPC sid
In DepthDetails ArticlePubMed