BDBM50481401 CHEMBL597358::ZINC 01758620
SMILES Cc1ccccc1COc1ccc(cc1)C(=O)[C@H]1[C@@H](N(Cc2ccncc2)C(=O)C1=O)c1cccc(O)c1
InChI Key InChIKey=GKLPPVHSFIVRLC-IZLXSDGUSA-N
Data  2 IC50
  Tab Delimited (TSV)   2D SDfile   Computed 3D by Vconf -m prep SDfile
Find this compound or compounds like it in BindingDB:
Activity Spreadsheet -- Enzyme Inhibition Constant Data from BindingDB
Found 2 hits for monomerid = 50481401
TargetGenome polyprotein(Dengue virus type 2)
University Of Basel
Curated by ChEMBL
LigandPNGBDBM50481401(CHEMBL597358 | ZINC 01758620)
Affinity DataIC50: >1.00E+5nM. Assay description: Inhibition of Dengue virus type 2 NS5 RNA methyltransferase SAM site with 0.1 % TX100
Ligand InfoPC cidPC sid
In DepthDetails ArticlePubMed
TargetGenome polyprotein(Dengue virus type 2)
University Of Basel
Curated by ChEMBL
LigandPNGBDBM50481401(CHEMBL597358 | ZINC 01758620)
Affinity DataIC50:  9.62E+3nM. Assay description: Inhibition of Dengue virus type 2 NS5 RNA methyltransferase SAM site
Ligand InfoPC cidPC sid
In DepthDetails ArticlePubMed