BDBM50481408 CHEMBL596747::ZINC 02642996
SMILES Cc1cc(C(=O)CSc2nc(N)cc(=O)[nH]2)c(C)n1Cc1ccc2OCOc2c1
InChI Key InChIKey=CZIRSEVSHBGBIZ-UHFFFAOYSA-N
Data  2 IC50
  Tab Delimited (TSV)   2D SDfile   Computed 3D by Vconf -m prep SDfile
Find this compound or compounds like it in BindingDB:
Activity Spreadsheet -- Enzyme Inhibition Constant Data from BindingDB
Found 2 hits for monomerid = 50481408
TargetGenome polyprotein(Dengue virus type 2)
University Of Basel
Curated by ChEMBL
LigandPNGBDBM50481408(CHEMBL596747 | ZINC 02642996)
Affinity DataIC50:  1.61E+4nM. Assay description: Inhibition of Dengue virus type 2 NS5 RNA methyltransferase SAM site
In DepthDetails ArticlePubMed
TargetGenome polyprotein(Dengue virus type 2)
University Of Basel
Curated by ChEMBL
LigandPNGBDBM50481408(CHEMBL596747 | ZINC 02642996)
Affinity DataIC50: >1.00E+5nM. Assay description: Inhibition of Dengue virus type 2 NS5 RNA methyltransferase SAM site with 0.1 % TX100
In DepthDetails ArticlePubMed