BDBM50481414 CHEMBL598785::ZINC 02129857
SMILES Cc1c(CC(=O)N[C@@H](Cc2c[nH]c3ccc(O)cc23)C(O)=O)c(=O)oc2cc3occ(c3cc12)C(C)(C)C
InChI Key InChIKey=VQVMCKTVRYRYFK-QHCPKHFHSA-N
Data  2 IC50
  Tab Delimited (TSV)   2D SDfile   Computed 3D by Vconf -m prep SDfile
Find this compound or compounds like it in BindingDB:
Activity Spreadsheet -- Enzyme Inhibition Constant Data from BindingDB
Found 2 hits for monomerid = 50481414
TargetGenome polyprotein(Dengue virus type 2)
University Of Basel
Curated by ChEMBL
LigandPNGBDBM50481414(CHEMBL598785 | ZINC 02129857)
Affinity DataIC50: >1.00E+5nM. Assay description: Inhibition of Dengue virus type 2 NS5 RNA methyltransferase RNA site with 0.1 % TX100
In DepthDetails ArticlePubMed
TargetGenome polyprotein(Dengue virus type 2)
University Of Basel
Curated by ChEMBL
LigandPNGBDBM50481414(CHEMBL598785 | ZINC 02129857)
Affinity DataIC50:  1.19E+4nM. Assay description: Inhibition of Dengue virus type 2 NS5 RNA methyltransferase RNA site
In DepthDetails ArticlePubMed