BDBM50481425 CHEMBL597777::ZINC 01078734
SMILES OC(=O)COc1ccccc1\C=N/NC(=O)Cc1csc(Nc2cccc(c2)C(F)(F)F)n1
InChI Key InChIKey=TZYCJQGYAOUYGY-MRUKODCESA-N
Data  2 IC50
  Tab Delimited (TSV)   2D SDfile   Computed 3D by Vconf -m prep SDfile
Find this compound or compounds like it in BindingDB:
Activity Spreadsheet -- Enzyme Inhibition Constant Data from BindingDB
Found 2 hits for monomerid = 50481425
TargetGenome polyprotein(Dengue virus type 2)
University Of Basel
Curated by ChEMBL
LigandPNGBDBM50481425(CHEMBL597777 | ZINC 01078734)
Affinity DataIC50:  1.24E+4nM. Assay description: Inhibition of Dengue virus type 2 NS5 RNA methyltransferase RNA site
In DepthDetails ArticlePubMed
TargetGenome polyprotein(Dengue virus type 2)
University Of Basel
Curated by ChEMBL
LigandPNGBDBM50481425(CHEMBL597777 | ZINC 01078734)
Affinity DataIC50: >1.00E+5nM. Assay description: Inhibition of Dengue virus type 2 NS5 RNA methyltransferase RNA site with 0.1 % TX100
In DepthDetails ArticlePubMed