BDBM50482948 CHEMBL1270920
SMILES CNC(=O)c1cn(C)c-2c1CCc1cnc(NC3CCN(CC3)S(C)(=O)=O)nc-21
InChI Key InChIKey=PBJNPQMXAFFDSZ-UHFFFAOYSA-N
Data  1 IC50
  Tab Delimited (TSV)   2D SDfile   Computed 3D by Vconf -m prep SDfile
Find this compound or compounds like it in BindingDB:
Activity Spreadsheet -- Enzyme Inhibition Constant Data from BindingDB
Found 1 hit for monomerid = 50482948
TargetCyclin-A1/Cyclin-A2/Cyclin-dependent kinase 2(Homo sapiens (Human))
Jinan University
Curated by ChEMBL
LigandPNGBDBM50482948(CHEMBL1270920)
Affinity DataIC50:  2nM. Assay description: Inhibition of CDK2/cyclin A
Ligand InfoPC cidPC sid
In DepthDetails ArticlePubMed